{"text_format":"1","workbook":"xlsx","n_sheets":4,"sheets":["Input","Lookup","Lists","Notes"],"not_rendered":{"charts":0,"images":2,"macros":1,"external_links":0,"defined_names":19,"comments":0,"pivot_tables":0},"unopened":[],"bounds":{"document_bytes":16777216,"sheet_cells":100000,"rows_first":2000,"rows_last":500,"rows_between":2000,"halvings":0,"cell_chars":16384,"cell_head_chars":4096},"cells_cut":0,"cells_raw":0,"read":"whole","date_system":"1900"}

{"sheet":"Input","index":0,"n_rows":28,"n_cols":27,"rows_kept":28,"cut":false,"hidden":false,"merged":[[23,1,23,2],[22,1,22,2],[0,0,2,4],[18,0,18,3],[18,4,18,8],[19,0,19,3],[19,4,19,8],[20,0,20,8],[26,22,27,23],[26,16,27,17],[26,19,27,20],[26,1,27,2],[25,10,25,11],[25,13,25,14],[25,16,25,17],[25,19,25,20],[26,4,27,5],[26,7,27,8],[26,10,27,11],[26,13,27,14],[25,1,25,2],[25,4,25,5],[25,7,25,8],[25,22,25,23],[20,9,20,13],[0,5,2,24],[3,0,3,24],[18,16,20,24],[4,0,17,24],[18,9,18,13],[18,14,20,15],[19,9,19,13]]}
[null,null,null,null,null,"Heathrow CVP Euro Standard Checking Tool"]
[]
[]
["Tool Information"]
["Vehicles comply with a specific regulatory emission standard when manufactured or first registered. In Europe these standards are called Euro Standards and apply to the pollutants nitrogen oxides (NOx), particulate matter (PM), carbon monoxide (CO) and hydrocarbons but not to CO2 or fuel consumption. The dates from which a Euro standard applies are defined in terms of type approval at year of manufacturer.  However, there is a grace period in the legisation between year of manufacturer and date of first registration to allow for stock holding.  This means that is it not always clear what standard a vehicle meets just from the year of registration as it may meet the latest standard or be an older version sold under the period of grace.  \n\nThe Heathrow Euro Standard Checking Tool allows identifying the emission standard of passenger cars, vans, heavy-goods vehicles and specialist GSE based on their date of manufacture or registration. This can be used when calculating the emisions performance of a vehicle or assessing whether it will meet a given emission standard in relation to local policy, regulation or incentive. To run the tool, the user is required to select the type of vehicle, fuel, engine size/type and provide either the date of manufacture or the date of registration. The tool will then automatically assign a Euro Standard and will provide an indication of the level of confidence of the estimate, based on the grace period between type approval and registration dates. Confidence levels can be either \"green\" or \"amber\". If the confidence level is \"amber\" then the registration date falls in the grace period, in this case the lower emission standard is assumed but the tool also indicates the alternative higher emission standard that it may comply with.  To be certain of the emission standard of a vehicle the actual date of manufactur is required.\n\nCaution! Date should be provided as DD/MM/YYYY. No future beyond 2050 are allowed. Do not overwrite the contents of the Euro Standard, Confidence and Alternative boxes. \nVersion: 2.1. Stable. QA/QC. \nReference: https://www.dieselnet.com\n                  http://emleg.com/  "]
[]
[]
[]
[]
[]
[]
[]
[]
[]
[]
[]
[]
[]
["Developed by:",null,null,null,"Michel Vedrenne",null,null,null,null,"michel.vedrenne@ricardo.com",null,null,null,null,"Comments:"]
["Managed by:",null,null,null,"Guy Hitchcock",null,null,null,null,"guy.hitchcock@ricardo.com"]
["Last Update:",null,null,null,null,null,null,null,null,"2016-11-30"]
[]
[null,"Date"]
[null,{"$f":"TODAY()","v":"2019-11-07"}]
[]
[null,"Vehicle Type",null,null,"Fuel Type",null,null,"Engine Size/Type",null,null,"Date",null,null,"Date Type",null,null,"Euro Standard",null,null,"Confidence",null,null,"Alternative"]
[null,null,null,null,null,null,null,null,null,null,null,null,null,null,null,null,{"$f":"IFERROR(VLOOKUP($AA$27&\"_1\",Lookup!$A$1:$N$175,COLUMN(Lookup!$M$1),FALSE),\"\")","v":""},null,null,"u",null,null,{"$f":"IFERROR(VLOOKUP($AA$27&\"_1\",Lookup!$A$1:$O$175,COLUMN(Lookup!$O$1),FALSE),\"\")","v":""},null,null,null,{"$f":"VehicleInput&\"_\"&FuelInput&\"_\"&EngineInput","v":"__"}]
[null,null,null,null,null,null,null,null,null,null,null,null,null,null,null,null,null,null,null,null,null,null,null,null,null,null,{"$f":"VLOOKUP($AA$27&\"_1\",Lookup!$A$1:$N$175,COLUMN(Lookup!$N$1),FALSE)","v":{"$error":"#N/A"}}]

{"sheet":"Lookup","index":1,"n_rows":176,"n_cols":15,"rows_kept":176,"cut":false,"hidden":true,"merged":[]}
["Code_Result","Pivot_Code","Vehicle Type","Fuel Type","Size","Activated","Type Approval Start","Type Approval End","Registration Start","Registration End","Manufacture","Registration","Euro Standard","Flag","Alternative"]
[{"$f":"B2&\"_\"&SUM(K2:L2)","v":"Car_Diesel_<1.4 l_0"},{"$f":"C2&\"_\"&D2&\"_\"&E2","v":"Car_Diesel_<1.4 l"},"Car","Diesel","<1.4 l",{"$f":"IF(B2=Input!$AA$27,1,0)","v":0},"1900-01-01",{"$f":"G3","v":"1992-07-01"},{"$f":"DATE(YEAR(G2)+1,MONTH(G2),DAY(G2))","v":"1901-01-01"},{"$f":"I3","v":"1993-07-01"},{"$f":"IF(AND(F2=1,DateType=\"Date of Manufacture\"),IF(AND(DateInput>G2,DateInput<=H2),1,0),0)","v":0},{"$f":"IF(AND(F2=1,DateType=\"Date of Registration\"),IF(AND(DateInput>I2,DateInput<=J2),1,0),0)","v":0},"Pre Euro 1",{"$f":"IF(AND(F2=1,K2=1),\"Green\",IF(AND(F2=1,L2=1),IF(AND(DateInput>H2,DateInput<=J2),\"Amber\",\"Green\"),0))","v":0},{"$f":"IF(DateInput>Input!$B$24,\"-\",IF(N2=\"Amber\",INDIRECT(ADDRESS(ROW(M2)+1,COLUMN(M2))),\"-\"))","v":"-"}]
[{"$f":"B3&\"_\"&SUM(K3:L3)","v":"Car_Diesel_<1.4 l_0"},{"$f":"C3&\"_\"&D3&\"_\"&E3","v":"Car_Diesel_<1.4 l"},{"$f":"C2","v":"Car"},{"$f":"D2","v":"Diesel"},{"$f":"E2","v":"<1.4 l"},{"$f":"IF(B3=Input!$AA$27,1,0)","v":0},"1992-07-01",{"$f":"G4","v":"1996-01-01"},"1993-07-01",{"$f":"I4","v":"1997-01-01"},0,0,"Euro 1",0,{"$f":"IF(DateInput>Input!$B$24,\"-\",IF(N3=\"Amber\",INDIRECT(ADDRESS(ROW(M3)+1,COLUMN(M3))),\"-\"))","v":"-"}]
["Car_Diesel_<1.4 l_0","Car_Diesel_<1.4 l",{"$f":"C3","v":"Car"},{"$f":"D3","v":"Diesel"},{"$f":"E3","v":"<1.4 l"},{"$f":"IF(B4=Input!$AA$27,1,0)","v":0},"1996-01-01",{"$f":"G6","v":"2000-01-01"},"1997-01-01",{"$f":"I6","v":"2001-01-01"},0,0,"Euro 2",0,{"$f":"IF(DateInput>Input!$B$24,\"-\",IF(N4=\"Amber\",INDIRECT(ADDRESS(ROW(M4)+2,COLUMN(M4))),\"-\"))","v":"-"}]
["Car_Diesel_<1.4 l_0","Car_Diesel_<1.4 l","Car","Diesel","<1.4 l",{"$f":"IF(B5=Input!$AA$27,1,0)","v":0},"1996-01-01",{"$f":"H4","v":"2000-01-01"},{"$f":"I4","v":"1997-01-01"},{"$f":"J4","v":"2001-01-01"},0,0,"Euro 2",0,{"$f":"IF(DateInput>Input!$B$24,\"-\",IF(N5=\"Amber\",INDIRECT(ADDRESS(ROW(M5)+1,COLUMN(M5))),\"-\"))","v":"-"}]
["Car_Diesel_<1.4 l_0","Car_Diesel_<1.4 l",{"$f":"C5","v":"Car"},{"$f":"D5","v":"Diesel"},{"$f":"E5","v":"<1.4 l"},{"$f":"IF(B6=Input!$AA$27,1,0)","v":0},"2000-01-01",{"$f":"G7","v":"2005-01-01"},"2001-01-01",{"$f":"I7","v":"2006-01-01"},0,0,"Euro 3",0,{"$f":"IF(DateInput>Input!$B$24,\"-\",IF(N6=\"Amber\",INDIRECT(ADDRESS(ROW(M6)+1,COLUMN(M6))),\"-\"))","v":"-"}]
["Car_Diesel_<1.4 l_0","Car_Diesel_<1.4 l","Car","Diesel","<1.4 l",{"$f":"IF(B7=Input!$AA$27,1,0)","v":0},"2005-01-01",{"$f":"G8","v":"2009-09-01"},"2006-01-01",{"$f":"I8","v":"2011-01-01"},0,0,"Euro 4",0,{"$f":"IF(DateInput>Input!$B$24,\"-\",IF(N7=\"Amber\",INDIRECT(ADDRESS(ROW(M7)+1,COLUMN(M7))),\"-\"))","v":"-"}]
["Car_Diesel_<1.4 l_0","Car_Diesel_<1.4 l","Car","Diesel","<1.4 l",{"$f":"IF(B8=Input!$AA$27,1,0)","v":0},"2009-09-01",{"$f":"G9","v":"2011-09-01"},"2011-01-01",{"$f":"I9","v":"2013-01-01"},0,0,"Euro 5a",0,{"$f":"IF(DateInput>Input!$B$24,\"-\",IF(N8=\"Amber\",INDIRECT(ADDRESS(ROW(M8)+1,COLUMN(M8))),\"-\"))","v":"-"}]
["Car_Diesel_<1.4 l_0","Car_Diesel_<1.4 l","Car","Diesel","<1.4 l",{"$f":"IF(B9=Input!$AA$27,1,0)","v":0},"2011-09-01",{"$f":"G10","v":"2014-09-01"},"2013-01-01",{"$f":"I10","v":"2015-09-01"},0,0,"Euro 5b",0,{"$f":"IF(DateInput>Input!$B$24,\"-\",IF(N9=\"Amber\",INDIRECT(ADDRESS(ROW(M9)+1,COLUMN(M9))),\"-\"))","v":"-"}]
["Car_Diesel_<1.4 l_0","Car_Diesel_<1.4 l","Car","Diesel","<1.4 l",{"$f":"IF(B10=Input!$AA$27,1,0)","v":0},"2014-09-01","2050-01-01",{"$f":"DATE(YEAR(G10)+1,MONTH(G10),DAY(G10))","v":"2015-09-01"},"2050-01-01",0,0,"Euro 6",0,{"$f":"IF(DateInput>Input!$B$24,\"-\",IF(N10=\"Amber\",INDIRECT(ADDRESS(ROW(M10)+1,COLUMN(M10))),\"-\"))","v":"-"}]
["Car_Petrol_<1.4 l_0","Car_Petrol_<1.4 l","Car","Petrol","<1.4 l",{"$f":"IF(B11=Input!$AA$27,1,0)","v":0},"1900-01-01",{"$f":"G12","v":"1992-07-01"},"1901-01-01",{"$f":"I12","v":"1993-07-01"},0,0,"Pre Euro 1",0,{"$f":"IF(DateInput>Input!$B$24,\"-\",IF(N11=\"Amber\",INDIRECT(ADDRESS(ROW(M11)+1,COLUMN(M11))),\"-\"))","v":"-"}]
["Car_Petrol_<1.4 l_0","Car_Petrol_<1.4 l","Car",{"$f":"D11","v":"Petrol"},"<1.4 l",{"$f":"IF(B12=Input!$AA$27,1,0)","v":0},"1992-07-01","1996-01-01","1993-07-01","1997-01-01",0,0,"Euro 1",0,{"$f":"IF(DateInput>Input!$B$24,\"-\",IF(N12=\"Amber\",INDIRECT(ADDRESS(ROW(M12)+1,COLUMN(M12))),\"-\"))","v":"-"}]
["Car_Petrol_<1.4 l_0","Car_Petrol_<1.4 l","Car","Petrol","<1.4 l",{"$f":"IF(B13=Input!$AA$27,1,0)","v":0},"1996-01-01","2000-01-01","1997-01-01","2001-01-01",0,0,"Euro 2",0,{"$f":"IF(DateInput>Input!$B$24,\"-\",IF(N13=\"Amber\",INDIRECT(ADDRESS(ROW(M13)+1,COLUMN(M13))),\"-\"))","v":"-"}]
["Car_Petrol_<1.4 l_0","Car_Petrol_<1.4 l","Car","Petrol","<1.4 l",{"$f":"IF(B14=Input!$AA$27,1,0)","v":0},"2000-01-01","2005-01-01","2001-01-01","2006-01-01",0,0,"Euro 3",0,{"$f":"IF(DateInput>Input!$B$24,\"-\",IF(N14=\"Amber\",INDIRECT(ADDRESS(ROW(M14)+1,COLUMN(M14))),\"-\"))","v":"-"}]
["Car_Petrol_<1.4 l_0","Car_Petrol_<1.4 l","Car","Petrol","<1.4 l",{"$f":"IF(B15=Input!$AA$27,1,0)","v":0},"2005-01-01","2009-09-01","2006-01-01","2011-01-01",0,0,"Euro 4",0,{"$f":"IF(DateInput>Input!$B$24,\"-\",IF(N15=\"Amber\",INDIRECT(ADDRESS(ROW(M15)+1,COLUMN(M15))),\"-\"))","v":"-"}]
["Car_Petrol_<1.4 l_0","Car_Petrol_<1.4 l","Car","Petrol","<1.4 l",{"$f":"IF(B16=Input!$AA$27,1,0)","v":0},"2009-09-01","2014-09-01","2011-01-01","2015-09-01",0,0,"Euro 5",0,{"$f":"IF(DateInput>Input!$B$24,\"-\",IF(N16=\"Amber\",INDIRECT(ADDRESS(ROW(M16)+1,COLUMN(M16))),\"-\"))","v":"-"}]
["Car_Petrol_<1.4 l_0","Car_Petrol_<1.4 l","Car","Petrol","<1.4 l",{"$f":"IF(B17=Input!$AA$27,1,0)","v":0},"2014-09-01","2050-01-01",{"$f":"DATE(YEAR(G17)+1,MONTH(G17),DAY(G17))","v":"2015-09-01"},{"$f":"J10","v":"2050-01-01"},0,0,"Euro 6",0,{"$f":"IF(DateInput>Input!$B$24,\"-\",IF(N17=\"Amber\",INDIRECT(ADDRESS(ROW(M17)+1,COLUMN(M17))),\"-\"))","v":"-"}]
["Car_Diesel_1.4-2.0 l_0","Car_Diesel_1.4-2.0 l","Car",{"$f":"D2","v":"Diesel"},"1.4-2.0 l",{"$f":"IF(B18=Input!$AA$27,1,0)","v":0},{"$f":"G2","v":"1900-01-01"},"1992-07-01","1901-01-01","1993-07-01",0,0,{"$f":"M2","v":"Pre Euro 1"},0,{"$f":"IF(DateInput>Input!$B$24,\"-\",IF(N18=\"Amber\",INDIRECT(ADDRESS(ROW(M18)+1,COLUMN(M18))),\"-\"))","v":"-"}]
["Car_Diesel_1.4-2.0 l_0","Car_Diesel_1.4-2.0 l","Car",{"$f":"D3","v":"Diesel"},{"$f":"E18","v":"1.4-2.0 l"},{"$f":"IF(B19=Input!$AA$27,1,0)","v":0},"1992-07-01","1996-01-01","1993-07-01","1997-01-01",0,0,{"$f":"M3","v":"Euro 1"},0,{"$f":"IF(DateInput>Input!$B$24,\"-\",IF(N19=\"Amber\",INDIRECT(ADDRESS(ROW(M19)+1,COLUMN(M19))),\"-\"))","v":"-"}]
["Car_Diesel_1.4-2.0 l_0","Car_Diesel_1.4-2.0 l","Car",{"$f":"D4","v":"Diesel"},{"$f":"E19","v":"1.4-2.0 l"},{"$f":"IF(B20=Input!$AA$27,1,0)","v":0},"1996-01-01","2000-01-01","1997-01-01","2001-01-01",0,0,{"$f":"M4","v":"Euro 2"},0,{"$f":"IF(DateInput>Input!$B$24,\"-\",IF(N20=\"Amber\",INDIRECT(ADDRESS(ROW(M20)+2,COLUMN(M20))),\"-\"))","v":"-"}]
["Car_Diesel_1.4-2.0 l_0","Car_Diesel_1.4-2.0 l","Car",{"$f":"D5","v":"Diesel"},"1.4-2.0 l",{"$f":"IF(B21=Input!$AA$27,1,0)","v":0},"1996-01-01","2000-01-01","1997-01-01","2001-01-01",0,0,{"$f":"M5","v":"Euro 2"},0,{"$f":"IF(DateInput>Input!$B$24,\"-\",IF(N21=\"Amber\",INDIRECT(ADDRESS(ROW(M21)+1,COLUMN(M21))),\"-\"))","v":"-"}]
["Car_Diesel_1.4-2.0 l_0","Car_Diesel_1.4-2.0 l","Car",{"$f":"D6","v":"Diesel"},"1.4-2.0 l",{"$f":"IF(B22=Input!$AA$27,1,0)","v":0},{"$f":"G6","v":"2000-01-01"},"2005-01-01","2001-01-01","2006-01-01",0,0,"Euro 3",0,{"$f":"IF(DateInput>Input!$B$24,\"-\",IF(N22=\"Amber\",INDIRECT(ADDRESS(ROW(M22)+1,COLUMN(M22))),\"-\"))","v":"-"}]
["Car_Diesel_1.4-2.0 l_0","Car_Diesel_1.4-2.0 l","Car","Diesel","1.4-2.0 l",{"$f":"IF(B23=Input!$AA$27,1,0)","v":0},{"$f":"G7","v":"2005-01-01"},"2009-09-01","2006-01-01","2011-01-01",0,0,"Euro 4",0,{"$f":"IF(DateInput>Input!$B$24,\"-\",IF(N23=\"Amber\",INDIRECT(ADDRESS(ROW(M23)+1,COLUMN(M23))),\"-\"))","v":"-"}]
["Car_Diesel_1.4-2.0 l_0","Car_Diesel_1.4-2.0 l","Car","Diesel","1.4-2.0 l",{"$f":"IF(B24=Input!$AA$27,1,0)","v":0},{"$f":"G8","v":"2009-09-01"},"2011-09-01","2011-01-01","2013-01-01",0,0,"Euro 5a",0,{"$f":"IF(DateInput>Input!$B$24,\"-\",IF(N24=\"Amber\",INDIRECT(ADDRESS(ROW(M24)+1,COLUMN(M24))),\"-\"))","v":"-"}]
["Car_Diesel_1.4-2.0 l_0","Car_Diesel_1.4-2.0 l","Car","Diesel","1.4-2.0 l",{"$f":"IF(B25=Input!$AA$27,1,0)","v":0},{"$f":"G9","v":"2011-09-01"},"2014-09-01","2013-01-01","2015-09-01",0,0,"Euro 5b",0,{"$f":"IF(DateInput>Input!$B$24,\"-\",IF(N25=\"Amber\",INDIRECT(ADDRESS(ROW(M25)+1,COLUMN(M25))),\"-\"))","v":"-"}]
["Car_Diesel_1.4-2.0 l_0","Car_Diesel_1.4-2.0 l","Car","Diesel","1.4-2.0 l",{"$f":"IF(B26=Input!$AA$27,1,0)","v":0},{"$f":"G10","v":"2014-09-01"},"2050-01-01","2015-09-01","2050-01-01",0,0,"Euro 6",0,{"$f":"IF(DateInput>Input!$B$24,\"-\",IF(N26=\"Amber\",INDIRECT(ADDRESS(ROW(M26)+1,COLUMN(M26))),\"-\"))","v":"-"}]
["Car_Petrol_1.4-2.0 l_0","Car_Petrol_1.4-2.0 l","Car","Petrol","1.4-2.0 l",{"$f":"IF(B27=Input!$AA$27,1,0)","v":0},{"$f":"G11","v":"1900-01-01"},"1992-07-01","1901-01-01","1993-07-01",0,0,"Pre Euro 1",0,{"$f":"IF(DateInput>Input!$B$24,\"-\",IF(N27=\"Amber\",INDIRECT(ADDRESS(ROW(M27)+1,COLUMN(M27))),\"-\"))","v":"-"}]
["Car_Petrol_1.4-2.0 l_0","Car_Petrol_1.4-2.0 l","Car","Petrol","1.4-2.0 l",{"$f":"IF(B28=Input!$AA$27,1,0)","v":0},{"$f":"G12","v":"1992-07-01"},"1996-01-01","1993-07-01","1997-01-01",0,0,"Euro 1",0,{"$f":"IF(DateInput>Input!$B$24,\"-\",IF(N28=\"Amber\",INDIRECT(ADDRESS(ROW(M28)+1,COLUMN(M28))),\"-\"))","v":"-"}]
["Car_Petrol_1.4-2.0 l_0","Car_Petrol_1.4-2.0 l","Car","Petrol","1.4-2.0 l",{"$f":"IF(B29=Input!$AA$27,1,0)","v":0},{"$f":"G13","v":"1996-01-01"},"2000-01-01","1997-01-01","2001-01-01",0,0,"Euro 2",0,{"$f":"IF(DateInput>Input!$B$24,\"-\",IF(N29=\"Amber\",INDIRECT(ADDRESS(ROW(M29)+1,COLUMN(M29))),\"-\"))","v":"-"}]
["Car_Petrol_1.4-2.0 l_0","Car_Petrol_1.4-2.0 l","Car","Petrol","1.4-2.0 l",{"$f":"IF(B30=Input!$AA$27,1,0)","v":0},{"$f":"G14","v":"2000-01-01"},"2005-01-01","2001-01-01","2006-01-01",0,0,"Euro 3",0,{"$f":"IF(DateInput>Input!$B$24,\"-\",IF(N30=\"Amber\",INDIRECT(ADDRESS(ROW(M30)+1,COLUMN(M30))),\"-\"))","v":"-"}]
["Car_Petrol_1.4-2.0 l_0","Car_Petrol_1.4-2.0 l","Car","Petrol","1.4-2.0 l",{"$f":"IF(B31=Input!$AA$27,1,0)","v":0},{"$f":"G15","v":"2005-01-01"},"2009-09-01","2006-01-01","2011-01-01",0,0,"Euro 4",0,{"$f":"IF(DateInput>Input!$B$24,\"-\",IF(N31=\"Amber\",INDIRECT(ADDRESS(ROW(M31)+1,COLUMN(M31))),\"-\"))","v":"-"}]
["Car_Petrol_1.4-2.0 l_0","Car_Petrol_1.4-2.0 l","Car","Petrol","1.4-2.0 l",{"$f":"IF(B32=Input!$AA$27,1,0)","v":0},{"$f":"G16","v":"2009-09-01"},"2014-09-01","2011-01-01","2015-09-01",0,0,"Euro 5",0,{"$f":"IF(DateInput>Input!$B$24,\"-\",IF(N32=\"Amber\",INDIRECT(ADDRESS(ROW(M32)+1,COLUMN(M32))),\"-\"))","v":"-"}]
["Car_Petrol_1.4-2.0 l_0","Car_Petrol_1.4-2.0 l","Car","Petrol","1.4-2.0 l",{"$f":"IF(B33=Input!$AA$27,1,0)","v":0},{"$f":"G17","v":"2014-09-01"},"2050-01-01","2015-09-01","2050-01-01",0,0,"Euro 6",0,{"$f":"IF(DateInput>Input!$B$24,\"-\",IF(N33=\"Amber\",INDIRECT(ADDRESS(ROW(M33)+1,COLUMN(M33))),\"-\"))","v":"-"}]
["Car_Diesel_>2.0 l_0","Car_Diesel_>2.0 l","Car","Diesel",">2.0 l",{"$f":"IF(B34=Input!$AA$27,1,0)","v":0},{"$f":"G18","v":"1900-01-01"},"1992-07-01","1901-01-01","1993-07-01",{"$f":"IF(AND(F34=1,DateType=\"Date of Manufacture\"),IF(AND(DateInput>G34,DateInput<=H34),1,0),0)","v":0},{"$f":"IF(AND(F34=1,DateType=\"Date of Registration\"),IF(AND(DateInput>I34,DateInput<=J34),1,0),0)","v":0},"Pre Euro 1",{"$f":"IF(AND(F34=1,K34=1),\"Green\",IF(AND(F34=1,L34=1),IF(AND(DateInput>H34,DateInput<=J34),\"Amber\",\"Green\"),0))","v":0},{"$f":"IF(DateInput>Input!$B$24,\"-\",IF(N34=\"Amber\",INDIRECT(ADDRESS(ROW(M34)+1,COLUMN(M34))),\"-\"))","v":"-"}]
["Car_Diesel_>2.0 l_0","Car_Diesel_>2.0 l","Car","Diesel",{"$f":"E34","v":">2.0 l"},{"$f":"IF(B35=Input!$AA$27,1,0)","v":0},{"$f":"G19","v":"1992-07-01"},"1996-01-01","1993-07-01","1997-01-01",0,0,"Euro 1",0,{"$f":"IF(DateInput>Input!$B$24,\"-\",IF(N35=\"Amber\",INDIRECT(ADDRESS(ROW(M35)+1,COLUMN(M35))),\"-\"))","v":"-"}]
["Car_Diesel_>2.0 l_0","Car_Diesel_>2.0 l","Car","Diesel",{"$f":"E35","v":">2.0 l"},{"$f":"IF(B36=Input!$AA$27,1,0)","v":0},{"$f":"G20","v":"1996-01-01"},"2000-01-01","1997-01-01","2001-01-01",0,0,"Euro 2",0,{"$f":"IF(DateInput>Input!$B$24,\"-\",IF(N36=\"Amber\",INDIRECT(ADDRESS(ROW(M36)+2,COLUMN(M36))),\"-\"))","v":"-"}]
["Car_Diesel_>2.0 l_0","Car_Diesel_>2.0 l","Car","Diesel",">2.0 l",{"$f":"IF(B37=Input!$AA$27,1,0)","v":0},{"$f":"G21","v":"1996-01-01"},"2000-01-01","1997-01-01","2001-01-01",0,0,"Euro 2",0,{"$f":"IF(DateInput>Input!$B$24,\"-\",IF(N37=\"Amber\",INDIRECT(ADDRESS(ROW(M37)+1,COLUMN(M37))),\"-\"))","v":"-"}]
["Car_Diesel_>2.0 l_0","Car_Diesel_>2.0 l","Car","Diesel",">2.0 l",{"$f":"IF(B38=Input!$AA$27,1,0)","v":0},{"$f":"G22","v":"2000-01-01"},"2005-01-01","2001-01-01","2006-01-01",0,0,"Euro 3",0,{"$f":"IF(DateInput>Input!$B$24,\"-\",IF(N38=\"Amber\",INDIRECT(ADDRESS(ROW(M38)+1,COLUMN(M38))),\"-\"))","v":"-"}]
["Car_Diesel_>2.0 l_0","Car_Diesel_>2.0 l","Car","Diesel",">2.0 l",{"$f":"IF(B39=Input!$AA$27,1,0)","v":0},{"$f":"G23","v":"2005-01-01"},"2009-09-01","2006-01-01","2011-01-01",0,0,"Euro 4",0,{"$f":"IF(DateInput>Input!$B$24,\"-\",IF(N39=\"Amber\",INDIRECT(ADDRESS(ROW(M39)+1,COLUMN(M39))),\"-\"))","v":"-"}]
["Car_Diesel_>2.0 l_0","Car_Diesel_>2.0 l","Car","Diesel",">2.0 l",{"$f":"IF(B40=Input!$AA$27,1,0)","v":0},{"$f":"G24","v":"2009-09-01"},"2011-09-01","2011-01-01","2013-01-01",0,0,"Euro 5a",0,{"$f":"IF(DateInput>Input!$B$24,\"-\",IF(N40=\"Amber\",INDIRECT(ADDRESS(ROW(M40)+1,COLUMN(M40))),\"-\"))","v":"-"}]
{"$rows_left_out":137}
{"sheet":"Lists","index":2,"n_rows":8,"n_cols":14,"rows_kept":8,"cut":false,"hidden":true,"merged":[]}
["Vehicle","Car","Van","HGV","Specialist_GSE","CarDiesel","CarPetrol","VanDiesel","VanPetrol","HGVDiesel","Specialist_GSEDiesel","Specialist_GSEIgnited",null,"Dates"]
["Car","Diesel","Diesel","Diesel","Diesel","<1.4 l","<1.4 l","N1 (I) - ≤1305 kg","N1 (I) - ≤1305 kg","≤85 kW",">560 kW","Hand-held, < 20 cm3, <19 kW",null,"Date of Manufacture"]
["Van","Petrol","Petrol",null,"SparkIgnited","1.4-2.0 l","1.4-2.0 l","N1 (II) - 1305-1760 kg","N1 (II) - 1305-1760 kg",">85 kW","130-560 kW","Hand-held, 20-50 cm3, <19 kw",null,"Date of Registration"]
["HGV",null,null,null,null,">2.0 l",">2.0 l","N1 (III) - >1760 kg","N1 (III) - >1760 kg",null,"75-130 kW","Hand-held, >50 cm3, <19 kW"]
["Specialist_GSE",null,null,null,null,null,null,"N2 - >3.5 t","N2 - >3.5 t",null,"56-75 kW","Non-hand-held, < 66 cm3, <19 kW"]
[null,null,null,null,null,null,null,null,null,null,"37-56 kW","Non-hand-held, 66-100 cm3, <19 kW"]
[null,null,null,null,null,null,null,null,null,null,"19-37 kW","Non-hand-held, 11-225 cm3, <19 kW"]
[null,null,null,null,null,null,null,null,null,null,null,"Non-hand-held, >225 cm3, <19 kW"]

{"sheet":"Notes","index":3,"n_rows":0,"n_cols":0,"rows_kept":0,"cut":false,"hidden":true,"merged":[]}