{"text_format":"1","workbook":"xlsx","n_sheets":7,"sheets":["Instructions","Data","Emissions","Euro Standards","Fuels","1.A.4 Non-road mobile sources","1.A.4 Non-road mobile sources 2"],"not_rendered":{"charts":0,"images":7,"macros":1,"external_links":0,"defined_names":62,"comments":1,"pivot_tables":0},"unopened":[],"bounds":{"document_bytes":16777216,"sheet_cells":100000,"rows_first":2000,"rows_last":500,"rows_between":2000,"halvings":0,"cell_chars":16384,"cell_head_chars":4096},"cells_cut":0,"cells_raw":0,"read":"whole","date_system":"1900"}

{"sheet":"Instructions","index":0,"n_rows":38,"n_cols":2,"rows_kept":38,"cut":false,"hidden":false,"merged":[]}
["User Instructions"]
[]
[null,"Go to \"Data Entry\" section"]
[]
[null,"Enter the following in the light grey cells:"]
[null,"● Period - that the data covers (DD/MM/YYYY)"]
[null,"● Make"]
[null,"● Model"]
[null,"● Description"]
[null,"● Hire Company"]
[null,"● Registration or ID"]
[null,"● Date or Year of Manufacture or Age (in years)"]
[null,"● Euro Standard1 (from the drop down list)"]
[null,"● Fuel Type (from the drop down list)"]
[null,"● Engine Type (from the drop down list for uncontrolled diesels only)"]
[null,"○ NADI: Naturally Aspirated Direct Injection"]
[null,"○ NAPC: Naturally Aspirated Pre-chamber Injection"]
[null,"○ TCDI: Turbo-Charged Direct Injection"]
[null,"○ TCPC: Turbo-Charged Pre-chamber Injection"]
[null,"○ ITCDI: Intercooled Turbo-Charged Direct Injection"]
[null,"○ ITCPC: Intercooled Turbo-Charged Pre- chamber Injection"]
[null,"● Net Power Rating (kW) or Net Power Range2 (kW from the drop down list)"]
[null,"● Fuel Use (litres) or Hours and Average Load Factor (%)"]
[]
[1,"There is no cross check between Date or Year of Manufacture and Euro Standard."]
[2,"It is not advisable to use Net Power Range in conjunction with Hours and Average Load Factor, as the calculations require a specific Net Power Rating."]
[null,"However, if this combination is entered then the calculations will be based on the mid point of the Power Range and a warning message will be given. "]
[]
[null,"If Net Power Range is entered as opposed to Net Power Rating then the Hours and Average Load Factor cells will turn red and a warning message will be given."]
[null,"If Hours and Average Load Factor are entered as opposed to Fuel Use then the Net Power Range cell will turn red and a warning message will be given."]
[null,"Cells will turn dark grey upon data entry and any alternative cells will become blacked out."]
[]
[null,"Click the \"Submit\" button to calculate emissions and transfer data to the \"Detailed Data\" section."]
[null,"Click the \"Reset\" button to clear un-submitted data."]
[null,"Click \"Clear All\" button to clear all data."]
[]
[null,"Click \"Edit Detailed Data\" to edit data prior to recalculation. Enter \"y\" or \"Y\" in the first column of any row of data you wish to delete."]
[null,"Click \"Recalculate\" to recalculate emissions having revised the Detailed Data and/or the Period."]

{"sheet":"Data","index":1,"n_rows":29,"n_cols":20,"rows_kept":29,"cut":false,"hidden":false,"merged":[[20,8,20,9],[21,8,21,9],[18,1,18,2],[18,3,18,4],[20,3,20,4],[20,1,20,2],[18,6,18,7],[20,6,20,7],[21,6,21,7],[18,8,18,9],[2,3,2,7],[3,3,3,7],[2,9,2,13],[3,9,3,13],[12,6,12,7],[8,8,8,9],[9,8,9,9],[9,6,9,7],[11,6,11,7],[11,8,11,9],[12,8,12,9],[8,3,8,4],[9,3,9,4],[10,3,10,4],[11,3,11,4],[6,1,6,2],[8,1,8,2],[9,1,9,2],[8,6,8,7],[14,1,14,2],[14,3,14,4],[14,6,16,9],[11,1,12,2],[15,3,15,4],[15,1,15,2],[16,1,16,2],[16,3,16,4],[10,1,10,2]]}
["Heathrow Non-road Mobile Machinery (NRMM) Register and Emissions Calculator"]
[]
[null,null,"Company Name:",null,null,null,null,null,"Tel:"]
[null,null,"Contact Name:",null,null,null,null,null,"Email:"]
[]
["Data Entry:"]
[null,"Period (DD/MM/YYYY)",null,null,"to",null,null,null,null,null,null,null,null,null,null,null,null,null,null,"Row"]
[]
[null,"ID or Reg",null,null,null,"info only","Description",null,null,null,"info only"]
[null,"Make",null,null,null,"info only","Hire Company",null,null,null,"info only"]
[null,"Model",null,null,null,"info only"]
[null,"Date of Manufacture\n(DD/MM/YYYY)",null,null,null,null,"or Year of Manufacture"]
[null,null,null,null,null,null,"or Age",null,null,null,"years"]
[]
[null,"Euro Standard",null,null,null,null,{"$f":"\nIF(AND(PowerRating=\"\",FuelUse=\"\"),IF(PowerRange=\"\",\nIF(AND(Hours<>\"\",LoadFactor<>\"\"),\"Warning: if Net Power Range is entered then calculations will be based on its mid point.\",\"\"),\nIF(AND(Hours<>\"\",LoadFactor<>\"\"),\"Warning: calculations will be based on the mid point of the Net Power Range.\",\"Warning: if Hours and Average Load Factor are entered then calculations will be based on the mid point of the Net Power Range.\")),\"\")","v":""}]
[null,"Fuel Type"]
[null,"Engine Type"]
[]
[null,"Net Power Rating",null,null,null,"kW","or Net Power Range",null,null,null,"kW"]
[]
[null,"Fuel Use In Period",null,null,null,"litres","or Hours",null,null,null,"hours"]
[null,null,null,null,null,null,"and Average Load Factor",null,null,null,"%"]
[]
["Summary Data:"]
[null,"Total Number",null,null,null,null,null,null,null,null,null,null,null,"Total Fuel Use (litres)","Total\nHours","Average Load Factor (%)","Total\nCO2 (kg)","Total\nNOx (kg)","Total\nPM (kg)","Total\nPM2.5 (kg)"]
[null,{"$f":"COUNTA(B29:B30)-1","v":0},null,null,null,null,null,null,null,null,null,null,null,{"$f":"SUM(N29:N30)","v":0},{"$f":"SUM(O29:O30)","v":0},{"$f":"SUMPRODUCT(O29:O30,P29:P30)/O26","v":{"$error":"#DIV/0!"}},{"$f":"SUM(Q29:Q30)","v":0},{"$f":"SUM(R29:R30)","v":0},{"$f":"SUM(S29:S30)","v":0},{"$f":"SUM(T29:T30)","v":0}]
[]
["Detailed Data:"]
[null,"Vehicle ID or Reg","Vehicle Make","Vehicle Model","Description","Hire Company","Date of\nManufacture","Year of\nManufacture","Euro Standard","Fuel Type","Engine Type","Net Power Rating (kW)","Net Power Range (kW)","Fuel Use (litres)","Hours","Load Factor (%)","CO2 (kg)","NOx (kg)","PM (kg)","PM2.5 (kg)"]

{"sheet":"Emissions","index":2,"n_rows":31,"n_cols":3,"rows_kept":31,"cut":false,"hidden":true,"merged":[]}
[null,"g/kWh","kg"]
["NOx",{"$f":"\nCHOOSE(iFuel,CHOOSE(iEuroStandard,\nINDEX('1.A.4 Non-road mobile sources'!24:24,iPowerRange+1),\nINDEX('1.A.4 Non-road mobile sources'!38:38,iPowerRange+1),\nINDEX('1.A.4 Non-road mobile sources'!66:66,iPowerRange+1),\nINDEX('1.A.4 Non-road mobile sources'!80:80,iPowerRange+1),\nINDEX('1.A.4 Non-road mobile sources'!94:94,iPowerRange+1),\nINDEX('1.A.4 Non-road mobile sources'!10:10,iPowerRange+1)*INDEX('1.A.4 Non-road mobile sources 2'!10:10,iEngineType+1),\nINDEX('1.A.4 Non-road mobile sources'!108:108,iPowerRange+1)),\n0,\nINDEX('1.A.4 Non-road mobile sources'!150:150,2),\nINDEX('1.A.4 Non-road mobile sources'!122:122,iPowerRange+1),\nINDEX('1.A.4 Non-road mobile sources'!136:136,iPowerRange+1))*(1+CHOOSE(iFuel,\n'1.A.4 Non-road mobile sources'!$Q10,\n0,\n'1.A.4 Non-road mobile sources'!$Q136,\n'1.A.4 Non-road mobile sources'!$Q122,\n'1.A.4 Non-road mobile sources'!$Q136))^iAge","v":{"$error":"#VALUE!"}},{"$f":"IFERROR($B2/$B$10*C$10,0)","v":0}]
["N2O",{"$f":"\nCHOOSE(iFuel,CHOOSE(iEuroStandard,\nINDEX('1.A.4 Non-road mobile sources'!25:25,iPowerRange+1),\nINDEX('1.A.4 Non-road mobile sources'!39:39,iPowerRange+1),\nINDEX('1.A.4 Non-road mobile sources'!67:67,iPowerRange+1),\nINDEX('1.A.4 Non-road mobile sources'!81:81,iPowerRange+1),\nINDEX('1.A.4 Non-road mobile sources'!95:95,iPowerRange+1),\nINDEX('1.A.4 Non-road mobile sources'!11:11,iPowerRange+1)*INDEX('1.A.4 Non-road mobile sources 2'!11:11,iEngineType+1),\nINDEX('1.A.4 Non-road mobile sources'!109:109,iPowerRange+1)),\n0,\nINDEX('1.A.4 Non-road mobile sources'!151:151,2),\nINDEX('1.A.4 Non-road mobile sources'!123:123,iPowerRange+1),\nINDEX('1.A.4 Non-road mobile sources'!137:137,iPowerRange+1))*(1+CHOOSE(iFuel,\n'1.A.4 Non-road mobile sources'!$Q11,\n0,\n'1.A.4 Non-road mobile sources'!$Q137,\n'1.A.4 Non-road mobile sources'!$Q123,\n'1.A.4 Non-road mobile sources'!$Q137))^iAge","v":{"$error":"#VALUE!"}},{"$f":"IFERROR($B3/$B$10*C$10,0)","v":0}]
["CH4",{"$f":"\nCHOOSE(iFuel,CHOOSE(iEuroStandard,\nINDEX('1.A.4 Non-road mobile sources'!26:26,iPowerRange+1),\nINDEX('1.A.4 Non-road mobile sources'!40:40,iPowerRange+1),\nINDEX('1.A.4 Non-road mobile sources'!68:68,iPowerRange+1),\nINDEX('1.A.4 Non-road mobile sources'!82:82,iPowerRange+1),\nINDEX('1.A.4 Non-road mobile sources'!96:96,iPowerRange+1),\nINDEX('1.A.4 Non-road mobile sources'!12:12,iPowerRange+1)*INDEX('1.A.4 Non-road mobile sources 2'!12:12,iEngineType+1),\nINDEX('1.A.4 Non-road mobile sources'!110:110,iPowerRange+1)),\n0,\nINDEX('1.A.4 Non-road mobile sources'!152:152,2),\nINDEX('1.A.4 Non-road mobile sources'!124:124,iPowerRange+1),\nINDEX('1.A.4 Non-road mobile sources'!138:138,iPowerRange+1))*(1+CHOOSE(iFuel,\n'1.A.4 Non-road mobile sources'!$Q12,\n0,\n'1.A.4 Non-road mobile sources'!$Q138,\n'1.A.4 Non-road mobile sources'!$Q124,\n'1.A.4 Non-road mobile sources'!$Q138))^iAge","v":{"$error":"#VALUE!"}},0]
["CO",{"$f":"\nCHOOSE(iFuel,CHOOSE(iEuroStandard,\nINDEX('1.A.4 Non-road mobile sources'!27:27,iPowerRange+1),\nINDEX('1.A.4 Non-road mobile sources'!41:41,iPowerRange+1),\nINDEX('1.A.4 Non-road mobile sources'!69:69,iPowerRange+1),\nINDEX('1.A.4 Non-road mobile sources'!83:83,iPowerRange+1),\nINDEX('1.A.4 Non-road mobile sources'!97:97,iPowerRange+1),\nINDEX('1.A.4 Non-road mobile sources'!13:13,iPowerRange+1)*INDEX('1.A.4 Non-road mobile sources 2'!13:13,iEngineType+1),\nINDEX('1.A.4 Non-road mobile sources'!111:111,iPowerRange+1)),\n0,\nINDEX('1.A.4 Non-road mobile sources'!153:153,2),\nINDEX('1.A.4 Non-road mobile sources'!125:125,iPowerRange+1),\nINDEX('1.A.4 Non-road mobile sources'!139:139,iPowerRange+1))*(1+CHOOSE(iFuel,\n'1.A.4 Non-road mobile sources'!$Q13,\n0,\n'1.A.4 Non-road mobile sources'!$Q139,\n'1.A.4 Non-road mobile sources'!$Q125,\n'1.A.4 Non-road mobile sources'!$Q139))^iAge","v":{"$error":"#VALUE!"}},0]
["NMVOC",{"$f":"\nCHOOSE(iFuel,CHOOSE(iEuroStandard,\nINDEX('1.A.4 Non-road mobile sources'!28:28,iPowerRange+1),\nINDEX('1.A.4 Non-road mobile sources'!42:42,iPowerRange+1),\nINDEX('1.A.4 Non-road mobile sources'!70:70,iPowerRange+1),\nINDEX('1.A.4 Non-road mobile sources'!84:84,iPowerRange+1),\nINDEX('1.A.4 Non-road mobile sources'!98:98,iPowerRange+1),\nINDEX('1.A.4 Non-road mobile sources'!14:14,iPowerRange+1)*INDEX('1.A.4 Non-road mobile sources 2'!14:14,iEngineType+1),\nINDEX('1.A.4 Non-road mobile sources'!112:112,iPowerRange+1)),\n0,\nINDEX('1.A.4 Non-road mobile sources'!154:154,2),\nINDEX('1.A.4 Non-road mobile sources'!126:126,iPowerRange+1),\nINDEX('1.A.4 Non-road mobile sources'!140:140,iPowerRange+1))*(1+CHOOSE(iFuel,\n'1.A.4 Non-road mobile sources'!$Q14,\n0,\n'1.A.4 Non-road mobile sources'!$Q140,\n'1.A.4 Non-road mobile sources'!$Q126,\n'1.A.4 Non-road mobile sources'!$Q140))^iAge","v":{"$error":"#VALUE!"}},0]
["PM",{"$f":"\nCHOOSE(iFuel,CHOOSE(iEuroStandard,\nINDEX('1.A.4 Non-road mobile sources'!29:29,iPowerRange+1),\nINDEX('1.A.4 Non-road mobile sources'!43:43,iPowerRange+1),\nINDEX('1.A.4 Non-road mobile sources'!71:71,iPowerRange+1),\nINDEX('1.A.4 Non-road mobile sources'!85:85,iPowerRange+1),\nINDEX('1.A.4 Non-road mobile sources'!99:99,iPowerRange+1),\nINDEX('1.A.4 Non-road mobile sources'!15:15,iPowerRange+1)*INDEX('1.A.4 Non-road mobile sources 2'!15:15,iEngineType+1),\nINDEX('1.A.4 Non-road mobile sources'!113:113,iPowerRange+1)),\n0,\nINDEX('1.A.4 Non-road mobile sources'!155:155,2),\nINDEX('1.A.4 Non-road mobile sources'!127:127,iPowerRange+1),\nINDEX('1.A.4 Non-road mobile sources'!141:141,iPowerRange+1))*(1+CHOOSE(iFuel,\n'1.A.4 Non-road mobile sources'!$Q15,\n0,\n'1.A.4 Non-road mobile sources'!$Q141,\n'1.A.4 Non-road mobile sources'!$Q127,\n'1.A.4 Non-road mobile sources'!$Q141))^iAge","v":{"$error":"#VALUE!"}},0]
["PM2.5",{"$f":"\nCHOOSE(iFuel,CHOOSE(iEuroStandard,\nINDEX('1.A.4 Non-road mobile sources'!30:30,iPowerRange+1),\nINDEX('1.A.4 Non-road mobile sources'!44:44,iPowerRange+1),\nINDEX('1.A.4 Non-road mobile sources'!72:72,iPowerRange+1),\nINDEX('1.A.4 Non-road mobile sources'!86:86,iPowerRange+1),\nINDEX('1.A.4 Non-road mobile sources'!100:100,iPowerRange+1),\nINDEX('1.A.4 Non-road mobile sources'!16:16,iPowerRange+1)*INDEX('1.A.4 Non-road mobile sources 2'!16:16,iEngineType+1),\nINDEX('1.A.4 Non-road mobile sources'!114:114,iPowerRange+1)),\n0,\nINDEX('1.A.4 Non-road mobile sources'!156:156,2),\nINDEX('1.A.4 Non-road mobile sources'!128:128,iPowerRange+1),\nINDEX('1.A.4 Non-road mobile sources'!142:142,iPowerRange+1))*(1+CHOOSE(iFuel,\n'1.A.4 Non-road mobile sources'!$Q16,\n0,\n'1.A.4 Non-road mobile sources'!$Q142,\n'1.A.4 Non-road mobile sources'!$Q128,\n'1.A.4 Non-road mobile sources'!$Q142))^iAge","v":{"$error":"#VALUE!"}},0]
["NH3",{"$f":"\nCHOOSE(iFuel,CHOOSE(iEuroStandard,\nINDEX('1.A.4 Non-road mobile sources'!31:31,iPowerRange+1),\nINDEX('1.A.4 Non-road mobile sources'!45:45,iPowerRange+1),\nINDEX('1.A.4 Non-road mobile sources'!73:73,iPowerRange+1),\nINDEX('1.A.4 Non-road mobile sources'!87:87,iPowerRange+1),\nINDEX('1.A.4 Non-road mobile sources'!101:101,iPowerRange+1),\nINDEX('1.A.4 Non-road mobile sources'!17:17,iPowerRange+1)*INDEX('1.A.4 Non-road mobile sources 2'!17:17,iEngineType+1),\nINDEX('1.A.4 Non-road mobile sources'!115:115,iPowerRange+1)),\n0,\nINDEX('1.A.4 Non-road mobile sources'!157:157,2),\nINDEX('1.A.4 Non-road mobile sources'!129:129,iPowerRange+1),\nINDEX('1.A.4 Non-road mobile sources'!143:143,iPowerRange+1))*(1+CHOOSE(iFuel,\n'1.A.4 Non-road mobile sources'!$Q17,\n0,\n'1.A.4 Non-road mobile sources'!$Q143,\n'1.A.4 Non-road mobile sources'!$Q129,\n'1.A.4 Non-road mobile sources'!$Q143))^iAge","v":{"$error":"#VALUE!"}},0]
["FC",{"$f":"\nCHOOSE(iFuel,CHOOSE(iEuroStandard,\nINDEX('1.A.4 Non-road mobile sources'!32:32,iPowerRange+1),\nINDEX('1.A.4 Non-road mobile sources'!46:46,iPowerRange+1),\nINDEX('1.A.4 Non-road mobile sources'!74:74,iPowerRange+1),\nINDEX('1.A.4 Non-road mobile sources'!88:88,iPowerRange+1),\nINDEX('1.A.4 Non-road mobile sources'!102:102,iPowerRange+1),\nINDEX('1.A.4 Non-road mobile sources'!18:18,iPowerRange+1)*INDEX('1.A.4 Non-road mobile sources 2'!18:18,iEngineType+1),\nINDEX('1.A.4 Non-road mobile sources'!116:116,iPowerRange+1)),\n0,\nINDEX('1.A.4 Non-road mobile sources'!158:158,2),\nINDEX('1.A.4 Non-road mobile sources'!130:130,iPowerRange+1),\nINDEX('1.A.4 Non-road mobile sources'!144:144,iPowerRange+1))*(1+CHOOSE(iFuel,\n'1.A.4 Non-road mobile sources'!$Q18,\n0,\n'1.A.4 Non-road mobile sources'!$Q144,\n'1.A.4 Non-road mobile sources'!$Q130,\n'1.A.4 Non-road mobile sources'!$Q144))^iAge","v":{"$error":"#VALUE!"}},{"$f":"IF(bFuelUse,FuelUse*INDEX(Densities,iFuel)/1000,PowerRating*Hours*LoadFactor/100*B10/1000)","v":{"$error":"#VALUE!"}}]
["CO2e",null,{"$f":"IFERROR(IF(bFuelUse,FuelUse,PowerRating*Hours*LoadFactor/100*B10/INDEX(Densities,iFuel))*INDEX(CO2e,iFuel)/1000,0)","v":0}]
[]
[]
[]
[{"$f":"ISNUMBER(Age)","v":false}]
[{"$f":"ISNUMBER(DateFrom)","v":false}]
[{"$f":"ISNUMBER(DateTo)","v":false}]
[{"$f":"ISNUMBER(DateManufacture)","v":false}]
[{"$f":"ISNUMBER(FuelUse)","v":false}]
[{"$f":"ISNUMBER(Hours)","v":false}]
[{"$f":"ISNUMBER(LoadFactor)","v":false}]
[{"$f":"ISNUMBER(YearManufacture)","v":false}]
[{"$f":"\nIF(bDateManufacture,YEAR(DateTo)-YEAR(DateManufacture)+IF(DateTo<DATE(YEAR(DateTo),MONTH(DateManufacture),DAY(DateManufacture)),-1,0),\nIF(bYearManufacture,YEAR(DateTo)-YearManufacture,\nIF(ISNUMBER(Age),Age,-1)))","v":-1}]
[{"$f":"IFERROR(MATCH(EngineType,EngineTypes,0),0)","v":0}]
[{"$f":"IFERROR(MATCH(EuroStandard,EuroStandards,0),0)","v":0}]
[{"$f":"IFERROR(MATCH(Fuel,Fuels,0),0)","v":0}]
[{"$f":"IFERROR(IF(ISNUMBER(PowerRating),13,MATCH(PowerRange,PowerRanges,0)),0)","v":0},{"$f":"IFERROR(MATCH(PowerRange,PowerRanges,0),0)","v":0},{"$f":"AND(PowerRating>=INDEX(PowerRangesMin,jPowerRange),OR(PowerRating<=INDEX(PowerRangesMax,jPowerRange),INDEX(PowerRangesMax,jPowerRange)=0))","v":false}]
[null,{"$f":"PowerRating","v":0}]
["Min",{"$f":"INDEX(PowerRangesMin,jPowerRange)","v":0}]
["Max",{"$f":"INDEX(PowerRangesMax,jPowerRange)","v":2}]
[null,{"$f":"INDEX(PowerRangesAvg,jPowerRange)","v":1}]

{"sheet":"Euro Standards","index":3,"n_rows":7,"n_cols":1,"rows_kept":7,"cut":false,"hidden":true,"merged":[]}
["Stage I"]
["Stage II"]
["Stage IIIA"]
["Stage IIIB"]
["Stage IV"]
["Uncontrolled"]
["Unknown"]

{"sheet":"Fuels","index":4,"n_rows":7,"n_cols":3,"rows_kept":7,"cut":false,"hidden":true,"merged":[]}
[null,"Density","CO2e"]
[null,"g/l","g/l"]
["Diesel",846,310]
["Electric",{"$error":"#N/A"},{"$error":"#N/A"}]
["LPG",580,167]
["Petrol two-stroke",738,267]
["Petrol four-stroke",738,267]

{"sheet":"1.A.4 Non-road mobile sources","index":5,"n_rows":158,"n_cols":17,"rows_kept":158,"cut":false,"hidden":true,"merged":[]}
[null,"Power Range in kW",null,null,null,null,null,null,null,null,null,null,null,"Power in kW"]
[null,"0-2","2-5","5-10","10-20","20-37","37-56","56-75","75-130","130-300","300-560","560-1000",">1000",{"$f":"PowerRating","v":0}]
["Min",0,2,5,10,20,37,56,75,130,300,560,1000]
["Max",2,5,10,20,37,56,75,130,300,560,1000]
["Avg",{"$f":"AVERAGE(B3:B4)","v":1},{"$f":"AVERAGE(C3:C4)","v":3.5},7.5,15,28.5,46.5,65.5,102.5,215,430,780,1000]
["Table 3-10 Baseline emission factors for uncontrolled diesel engines in [g/kWh]",null,null,null,null,null,null,null,null,null,null,null,null,null,null,"Table 3-17 Degradation factors of diesel engines for the different pollutants and fuel consumption"]
["Pollutant","Power range in kW",null,null,null,null,null,null,null,null,null,null,null,"Power in kW",null,"Pollutant","Degradation factor"]
["[g/kWh]","0-20",null,null,null,"20-37","37-75",null,"75-130","130-300","300-560","560-1000",">1000",{"$f":"PowerRating","v":0},null,null,"per year"]
["Implementation date"]
["NOx",14.4,{"$f":"B10","v":14.4},{"$f":"C10","v":14.4},{"$f":"D10","v":14.4},14.4,14.4,{"$f":"G10","v":14.4},14.4,14.4,14.4,14.4,14.4,{"$f":"\nIF(PowerRating>1000,M10,\nIF(PowerRating>560,L10,\nIF(PowerRating>300,K10,\nIF(PowerRating>130,J10,\nIF(PowerRating>75,I10,\nIF(PowerRating>37,G10,\nIF(PowerRating>20,F10,B10)))))))","v":14.4},null,"NOx:",0]
["N2O",3.5000000000000003E-2,3.5000000000000003E-2,3.5000000000000003E-2,3.5000000000000003E-2,3.5000000000000003E-2,3.5000000000000003E-2,3.5000000000000003E-2,3.5000000000000003E-2,3.5000000000000003E-2,3.5000000000000003E-2,3.5000000000000003E-2,3.5000000000000003E-2,3.5000000000000003E-2,null,"N2O/NH3:",0]
["CH4",0.05,0.05,0.05,0.05,0.05,0.05,0.05,0.05,0.05,0.05,0.05,0.05,0.05,null,"CH4/NMVOC:",1.4999999999999999E-2]
["CO",8.3800000000000008,8.3800000000000008,8.3800000000000008,8.3800000000000008,6.43,5.0599999999999996,5.0599999999999996,3.76,3,3,3,3,8.3800000000000008,null,"CO",1.4999999999999999E-2]
["NMVOC",3.82,3.82,3.82,3.82,2.91,2.2799999999999998,2.2799999999999998,1.67,1.3,1.3,1.3,1.3,3.82,null,"CH4/NMVOC:",1.4999999999999999E-2]
["PM",2.2200000000000002,2.2200000000000002,2.2200000000000002,2.2200000000000002,1.81,1.51,1.51,1.23,1.1000000000000001,1.1000000000000001,1.1000000000000001,1.1000000000000001,2.2200000000000002,null,"PM:",0.03]
["PM2.5",2.09,2.09,2.09,2.09,1.7,1.42,1.42,1.1599999999999999,1.03,1.03,1.03,1.03,2.09,null,"PM:",0.03]
["NH3",2E-3,2E-3,2E-3,2E-3,2E-3,2E-3,{"$f":"G17","v":2E-3},2E-3,2E-3,2E-3,2E-3,2E-3,2E-3,null,"N2O/NH3:",0]
["FC",271,271,271,271,269,265,{"$f":"G18","v":265},260,254,254,254,254,271,null,"FC/SO2/CO2:",0.01]
[]
["Table 3-11 Baseline emission factors for NRMM stage I (for 37 ≤ P < 560 kW) controlled diesel engines in [g/kWh], irrespective of engine type"]
["Pollutant","Power Range in kW",null,null,null,null,null,null,null,null,null,null,null,"Power in kW"]
["[g/kWh]","0-20",null,null,null,"20-37","37-75",null,"75-130","130-300","300-560","560-1000",">1000",{"$f":"PowerRating","v":0}]
["Implementation date (1)","N/A",null,null,null,"N/A","1.7.98",null,"1.7.98","1.7.98","1.7.98","N/A","N/A"]
["NOx",14.4,{"$f":"B24","v":14.4},{"$f":"C24","v":14.4},{"$f":"D24","v":14.4},14.4,9.1999999999999993,{"$f":"G24","v":9.1999999999999993},9.1999999999999993,9.1999999999999993,9.1999999999999993,14.4,14.4,{"$f":"\nIF(PowerRating>1000,M24,\nIF(PowerRating>560,L24,\nIF(PowerRating>300,K24,\nIF(PowerRating>130,J24,\nIF(PowerRating>75,I24,\nIF(PowerRating>37,G24,\nIF(PowerRating>20,F24,B24)))))))","v":14.4}]
["N2O",3.5000000000000003E-2,3.5000000000000003E-2,3.5000000000000003E-2,3.5000000000000003E-2,3.5000000000000003E-2,3.5000000000000003E-2,3.5000000000000003E-2,3.5000000000000003E-2,3.5000000000000003E-2,3.5000000000000003E-2,3.5000000000000003E-2,3.5000000000000003E-2,3.5000000000000003E-2]
["CH4",0.05,0.05,0.05,0.05,0.05,0.05,0.05,0.05,0.05,0.05,0.05,0.05,0.05]
["CO",8.3800000000000008,8.3800000000000008,8.3800000000000008,8.3800000000000008,6.43,6.5,6.5,5,5,5,3,3,8.3800000000000008]
["NMVOC",3.82,3.82,3.82,3.82,2.91,1.3,1.3,1.3,1.3,1.3,1.3,1.3,3.82]
["PM",2.2200000000000002,2.2200000000000002,2.2200000000000002,2.2200000000000002,1.81,0.85,0.85,0.7,0.54,0.54,1.1000000000000001,1.1000000000000001,2.2200000000000002]
["PM2.5",2.09,2.09,2.09,2.09,1.7,0.8,0.8,0.66,0.51,0.51,1.03,1.03,2.09]
["NH3",2E-3,2E-3,2E-3,2E-3,2E-3,2E-3,2E-3,2E-3,2E-3,2E-3,2E-3,2E-3,2E-3]
["FC",271,271,271,271,269,265,265,260,254,254,254,254,271]
[]
["Table 3-12 Baseline emission factors for NRMM stage II (for 20 ≤ P < 560 kW) controlled diesel engines in [g/kWh], irrespective of engine type"]
["Pollutant","Power Range in kW",null,null,null,null,null,null,null,null,null,null,null,"Power in kW"]
["[g/kWh]","0–20\n0–18",null,null,null,"20–37\n18–37","37-75",null,"75-130","130-300","300-560","560-1000",">1000",{"$f":"PowerRating","v":0}]
["Implementation date (see footnote)","N/A",{"$f":"B37","v":"N/A"},{"$f":"C37","v":"N/A"},{"$f":"D37","v":"N/A"},"1.1.2000","1.1.2003",{"$f":"G37","v":"1.1.2003"},"1.1.2002","1.1.2001","1.1.2001","N/A","N/A"]
["NOx",14.4,14.4,14.4,14.4,8.5,8,8,7,7,7,14.4,14.4,{"$f":"\nIF(PowerRating>1000,M38,\nIF(PowerRating>560,L38,\nIF(PowerRating>300,K38,\nIF(PowerRating>130,J38,\nIF(PowerRating>75,I38,\nIF(PowerRating>37,G38,\nIF(PowerRating>18,F38,B38)))))))","v":14.4}]
["N2O",3.5000000000000003E-2,3.5000000000000003E-2,3.5000000000000003E-2,3.5000000000000003E-2,3.5000000000000003E-2,3.5000000000000003E-2,3.5000000000000003E-2,3.5000000000000003E-2,3.5000000000000003E-2,3.5000000000000003E-2,3.5000000000000003E-2,3.5000000000000003E-2,{"$f":"\nIF(PowerRating>1000,M39,\nIF(PowerRating>560,L39,\nIF(PowerRating>300,K39,\nIF(PowerRating>130,J39,\nIF(PowerRating>75,I39,\nIF(PowerRating>37,G39,\nIF(PowerRating>20,F39,B39)))))))","v":3.5000000000000003E-2}]
["CH4",0.05,0.05,0.05,0.05,0.05,0.05,0.05,0.05,0.05,0.05,0.05,0.05,{"$f":"\nIF(PowerRating>1000,M40,\nIF(PowerRating>560,L40,\nIF(PowerRating>300,K40,\nIF(PowerRating>130,J40,\nIF(PowerRating>75,I40,\nIF(PowerRating>37,G40,\nIF(PowerRating>20,F40,B40)))))))","v":0.05}]
{"$rows_left_out":119}
{"sheet":"1.A.4 Non-road mobile sources 2","index":6,"n_rows":18,"n_cols":7,"rows_kept":18,"cut":false,"hidden":true,"merged":[]}
["Table 3-16 Pollutant weighing factors as a function of engine design parameters for uncontrolled diesel engines"]
["Engine type","NOx","NMVOC/CH4","CO","PM","FC/SO2/CO2","N2O/NH3"]
["NADI",1,0.8,0.8,0.9,0.95,1]
["TCDI/ITCDI",0.8,0.8,0.8,0.8,0.95,1]
["NAPC",0.8,1,1,1.2,1.1000000000000001,1]
["TCPC",0.75,0.95,0.95,1.1000000000000001,1.05,1]
["ITCPC",0.7,0.9,0.9,1,1.05,1]
[]
["Engine type","NADI","TCDI/ITCDI","NAPC","TCPC","ITCPC"]
["NOx",1,0.8,0.8,0.75,0.7]
["N2O",1,1,1,1,1]
["CH4",0.8,0.8,1,0.95,0.9]
["CO",0.8,0.8,1,0.95,0.9]
["NMVOC",0.8,0.8,1,0.95,0.9]
["PM",0.9,0.8,1.2,1.1000000000000001,1]
["PM2.5",0.9,0.8,1.2,1.1000000000000001,1]
["NH3",1,1,1,1,1]
["FC",0.95,0.95,1.1000000000000001,1.05,1.05]